RegistrationNumber,NDISNumber,SupportsDeliveredFrom,SupportsDeliveredTo,SupportNumber,ClaimReference,Quantity,UnitPrice,GSTCode,AuthorisedBy,ParticipantApproved,InKindFundingProgram,ClaimType,CancellationReason,ABNOfSupportProvider,SupportProviderName,InvoiceDate,InvoiceFileName,InvoiceFileExempt
430000000,430416461,17/06/2023,30/06/2023,03_090000911_0103_1_1,CSV-02,52,1,P2,,,,,,95781517612,2U Support Services,30/06/2023,2.pdf,
430000000,430416461,18/06/2023,18/06/2023,04_106_0125_6_1,CSV-03,6,112.85,P2,,,,,,73733922642,1Care Disability Support,30/06/2023,3.pdf,
430000000,430416461,2/07/2023,2/07/2023,01_014_0107_1_1,CSV-05,6,65,P1,,,,,,95781517612,2U Support Services,2/07/2023,5.pdf,
430000000,430416461,1/07/2023,2/07/2023,01_013_0107_1_1,CSV-05,6,55,P1,,,,,,95781517612,2U Support Services,2/07/2023,5.pdf,
430000000,430416461,19/06/2023,19/06/2023,04_104_0125_6_1,CSV-06,4,46.25,P2,,,,,,73733922642,1Care Disability Support,19/06/2023,6.pdf,
430000000,430416461,4/07/2023,4/07/2023,14_034_0127_8_3,CSV-PPT,1,104.45,P2,,,,,,92624532038,360 HEALTH MANAGEMENT,4/07/2023,,YES
430000000,430416461,4/07/2023,4/07/2023,14_033_0127_8_3,CSV-PPT,1,232.35,P2,,,,,,92624532038,360 HEALTH MANAGEMENT,4/07/2023,,YES
430000000,430409181,3/07/2023,3/07/2023,04_799_0104_6_1,CSV-10,5,1,P2,,,,,,99000112729,AFFORD,3/07/2023,10.pdf,
430000000,430409181,23/06/2023,30/06/2023,01_020_0120_1_1,CSV-11,2,37.57,P1,,,,,,99000112729,AFFORD,30/06/2023,11.pdf,
430000000,430409181,1/07/2023,1/07/2023,01_013_0107_1_1,CSV-371,4,85,P2,,,,,,49133306902,ACHIEVE AUSTRALIA,2/07/2023,371.pdf,
430000000,430409181,26/06/2023,30/06/2023,01_011_0107_1_1,CSV-371,20,60,P2,,,,,,49133306902,ACHIEVE AUSTRALIA,2/07/2023,371.pdf,
430000000,430409181,2/07/2023,2/07/2023,01_014_0107_1_1,CSV-371,4,110,P2,,,,,,49133306902,ACHIEVE AUSTRALIA,2/07/2023,371.pdf,
430000000,430409181,28/06/2023,28/06/2023,04_590_0125_6_1,CSV-371,5,1,P2,,,,,,49133306902,ACHIEVE AUSTRALIA,2/07/2023,371.pdf,
430000000,430409181,4/07/2023,4/07/2023,05_122203821_0105_1_2,CSV-13,13312.86,1,P2,,,,,,99000112729,AFFORD,4/07/2023,13.pdf,
430000000,430409181,17/06/2023,17/06/2023,15_619_0128_1_3,CSV-15,0.5,193.99,P2,,,,,,95781517612,2U Support Services,30/06/2023,15.pdf,
